Reaction Details
TargetLeukotriene A-4 hydrolase
LigandBDBM50272099
Substrate/Competitorn/a
Meas. Tech.ChEMBL_510221 (CHEMBL1004837)
IC50 9200±n/a nM
Citation Enomoto, HMorikawa, YMiyake, YTsuji, FMizuchi, MSuhara, HFujimura, KHoriuchi, MBan, M Synthesis and biological evaluation of N-mercaptoacylproline and N-mercaptoacylthiazolidine-4-carboxylic acid derivatives as leukotriene A4 hydrolase inhibitors. Bioorg Med Chem Lett18:4529-32 (2008) 
 
Leukotriene A-4 hydrolase
Name:Leukotriene A-4 hydrolase
Type:PROTEIN
Mol. Mass.:68972.78
Organism:Cavia porcellus
Description:ChEMBL_544515
Residue:611
BDBM50272099
NameBDBM50272099
Synonyms:(2S,5S)-1-((S)-3-mercapto-2-methylpropanoyl)-5-(naphthalen-1-ylmethylthio)pyrrolidine-2-carboxylic acid | CHEMBL526896
TypeSmall organic molecule
Emp. Form.C20H23NO3S2
Mol. Mass.389.532
SMILESC[C@H](CS)C(=O)N1[C@H](CC[C@H]1C(O)=O)SCc1cccc2ccccc12