Reaction Details
TargetAngiotensin-converting enzyme
LigandBDBM50272061
Substrate/Competitorn/a
Meas. Tech.ChEMBL_510222 (CHEMBL1004838)
IC50 0.18±n/a nM
Citation Enomoto, HMorikawa, YMiyake, YTsuji, FMizuchi, MSuhara, HFujimura, KHoriuchi, MBan, M Synthesis and biological evaluation of N-mercaptoacylproline and N-mercaptoacylthiazolidine-4-carboxylic acid derivatives as leukotriene A4 hydrolase inhibitors. Bioorg Med Chem Lett18:4529-32 (2008) 
 
Angiotensin-converting enzyme
Name:Angiotensin-converting enzyme
Type:Enzyme
Mol. Mass.:149709.01
Organism:Homo sapiens (Human)
Description:n/a
Residue:1306
BDBM50272061
NameBDBM50272061
Synonyms:(2S,5S)-1-((S)-3-mercapto-2-methylpropanoyl)-5-(phenethylthio)pyrrolidine-2-carboxylic acid | CHEMBL526298
TypeSmall organic molecule
Emp. Form.C17H23NO3S2
Mol. Mass.353.499
SMILESC[C@H](CS)C(=O)N1[C@H](CC[C@H]1C(O)=O)SCCc1ccccc1