Reaction Details
TargetB1 bradykinin receptor
LigandBDBM50182221
Substrate/Competitorn/a
Meas. Tech.ChEMBL_510232 (CHEMBL1005610)
IC50 13±n/a nM
Citation Chen, JJQian, WBiswas, KViswanadhan, VNAskew, BCHitchcock, SHungate, RWArik, LJohnson, E Discovery of dihydroquinoxalinone acetamides containing bicyclic amines as potent Bradykinin B1 receptor antagonists. Bioorg Med Chem Lett18:4477-81 (2008) 
 
B1 bradykinin receptor
Name:B1 bradykinin receptor
Type:Enzyme
Mol. Mass.:40508.87
Organism:Homo sapiens (Human)
Description:P46663
Residue:353
BDBM50182221
NameBDBM50182221
Synonyms:CHEMBL381366 | N-((R)-6-((tert-butylamino)methyl)-1,2,3,4-tetrahydronaphthalen-1-yl)-2-((S)-1-(3-(trifluoromethyl)phenylsulfonyl)piperidin-2-yl)acetamide
TypeSmall organic molecule
Emp. Form.C29H38F3N3O3S
Mol. Mass.565.691
SMILESCC(C)(C)NCc1ccc2[C@@H](CCCc2c1)NC(=O)C[C@@H]1CCCCN1S(=O)(=O)c1cccc(c1)C(F)(F)F