Reaction Details
TargetEpidermal growth factor receptor
LigandBDBM50245472
Substrate/Competitorn/a
Meas. Tech.ChEMBL_512831 (CHEMBL971642)
IC50 30±n/a nM
Citation Hughes, TVXu, GWetter, SKConnolly, PJEmanuel, SLKarnachi, PPollack, SRPandey, NAdams, MMoreno-Mazza, SMiddleton, SAGreenberger, LM A novel 5-[1,3,4-oxadiazol-2-yl]-N-aryl-4,6-pyrimidine diamine having dual EGFR/HER2 kinase activity: design, synthesis, and biological activity. Bioorg Med Chem Lett18:4896-9 (2008) 
 
Epidermal growth factor receptor
Name:Epidermal growth factor receptor
Type:Receptor Kinase Domain
Mol. Mass.:134279.59
Organism:Homo sapiens (Human)
Description:P00533
Residue:1210
BDBM50245472
NameBDBM50245472
Synonyms:CHEMBL472545 | N-(4-Benzyloxy-3-chloro-phenyl)-5-[5-(2-morpholin-4-yl-ethyl)-[1,3,4]oxadiazol-2-yl]-pyrimidine-4,6-diamine
TypeSmall organic molecule
Emp. Form.C25H26ClN7O3
Mol. Mass.507.972
SMILESNc1ncnc(Nc2ccc(OCc3ccccc3)c(Cl)c2)c1-c1nnc(CCN2CCOCC2)o1