Reaction Details
TargetReceptor tyrosine-protein kinase erbB-2
LigandBDBM50245471
Substrate/Competitorn/a
Meas. Tech.ChEMBL_512832 (CHEMBL971643)
IC50 5700±n/a nM
Citation Hughes, TVXu, GWetter, SKConnolly, PJEmanuel, SLKarnachi, PPollack, SRPandey, NAdams, MMoreno-Mazza, SMiddleton, SAGreenberger, LM A novel 5-[1,3,4-oxadiazol-2-yl]-N-aryl-4,6-pyrimidine diamine having dual EGFR/HER2 kinase activity: design, synthesis, and biological activity. Bioorg Med Chem Lett18:4896-9 (2008) 
 
Receptor tyrosine-protein kinase erbB-2
Name:Receptor tyrosine-protein kinase erbB-2
Type:n/a
Mol. Mass.:137894.47
Organism:Homo sapiens (Human)
Description:P04626
Residue:1255
BDBM50245471
NameBDBM50245471
Synonyms:4-amino-6-(4-(benzyloxy)-3-chlorophenylamino)-N'-(3-morpholinopropanoyl)pyrimidine-5-carbohydrazide | CHEMBL472544
TypeSmall organic molecule
Emp. Form.C25H28ClN7O4
Mol. Mass.525.987
SMILESNc1ncnc(Nc2ccc(OCc3ccccc3)c(Cl)c2)c1C(=O)NNC(=O)CCN1CCOCC1