Reaction Details
TargetVascular endothelial growth factor receptor 2
LigandBDBM50245410
Substrate/Competitorn/a
Meas. Tech.ChEMBL_512837 (CHEMBL972550)
IC50>100000±n/a nM
Citation Hughes, TVXu, GWetter, SKConnolly, PJEmanuel, SLKarnachi, PPollack, SRPandey, NAdams, MMoreno-Mazza, SMiddleton, SAGreenberger, LM A novel 5-[1,3,4-oxadiazol-2-yl]-N-aryl-4,6-pyrimidine diamine having dual EGFR/HER2 kinase activity: design, synthesis, and biological activity. Bioorg Med Chem Lett18:4896-9 (2008) 
 
Vascular endothelial growth factor receptor 2
Name:Vascular endothelial growth factor receptor 2
Type:Receptor Tyrosine Kinase
Mol. Mass.:151510.97
Organism:Homo sapiens (Human)
Description:P35968
Residue:1356
BDBM50245410
NameBDBM50245410
Synonyms:4-amino-6-(4-(benzyloxy)-3-chlorophenylamino)-N,N-diethylpyrimidine-5-carboxamide | CHEMBL452727
TypeSmall organic molecule
Emp. Form.C22H24ClN5O2
Mol. Mass.425.911
SMILESCCN(CC)C(=O)c1c(N)ncnc1Nc1ccc(OCc2ccccc2)c(Cl)c1