Reaction Details
TargetVascular endothelial growth factor receptor 2
LigandBDBM50245364
Substrate/Competitorn/a
Meas. Tech.ChEMBL_512837 (CHEMBL972550)
IC50>100000±n/a nM
Citation Hughes, TVXu, GWetter, SKConnolly, PJEmanuel, SLKarnachi, PPollack, SRPandey, NAdams, MMoreno-Mazza, SMiddleton, SAGreenberger, LM A novel 5-[1,3,4-oxadiazol-2-yl]-N-aryl-4,6-pyrimidine diamine having dual EGFR/HER2 kinase activity: design, synthesis, and biological activity. Bioorg Med Chem Lett18:4896-9 (2008) 
 
Vascular endothelial growth factor receptor 2
Name:Vascular endothelial growth factor receptor 2
Type:Receptor Tyrosine Kinase
Mol. Mass.:151510.97
Organism:Homo sapiens (Human)
Description:P35968
Residue:1356
BDBM50245364
NameBDBM50245364
Synonyms:4-amino-6-(4-(benzyloxy)-3-chlorophenylamino)-N-(2-(piperidin-1-yl)ethyl)pyrimidine-5-carboxamide | CHEMBL462343
TypeSmall organic molecule
Emp. Form.C25H29ClN6O2
Mol. Mass.480.99
SMILESNc1ncnc(Nc2ccc(OCc3ccccc3)c(Cl)c2)c1C(=O)NCCN1CCCCC1