Reaction Details
TargetCholecystokinin receptor type A
LigandBDBM50245188
Substrate/Competitorn/a
Meas. Tech.ChEMBL_513418 (CHEMBL976505)
EC50 0.034±n/a nM
Citation Berger, RZhu, CHansen, ARHarper, BChen, ZHolt, TGHubert, JLee, SJPan, JQian, SReitman, MLStrack, AMWeingarth, DTWolff, MMacneil, DJWeber, AEEdmondson, SD 2-Substituted piperazine-derived imidazole carboxamides as potent and selective CCK1R agonists for the treatment of obesity. Bioorg Med Chem Lett18:4833-7 (2008) 
 
Cholecystokinin receptor type A
Name:Cholecystokinin receptor type A
Type:G Protein-Coupled Receptor (GPCR)
Mol. Mass.:47859.34
Organism:Homo sapiens (Human)
Description:Stable expression of human CCK-1 receptors in HEK 293 cells.
Residue:428
BDBM50245188
NameBDBM50245188
Synonyms:3-((S)-3-((carboxymethoxy)methyl)-4-(1-(3-ethoxyphenyl)-2-(2-fluoro-4-methylphenyl)-1H-imidazole-4-carbonyl)piperazin-1-yl)-1-naphthoic acid | CHEMBL498958
TypeSmall organic molecule
Emp. Form.C37H35FN4O7
Mol. Mass.666.6948
SMILESCCOc1cccc(c1)-n1cc(nc1-c1ccc(C)cc1F)C(=O)N1CCN(C[C@H]1COCC(O)=O)c1cc(C(O)=O)c2ccccc2c1