Reaction Details
TargetVascular endothelial growth factor receptor 2
LigandBDBM50264616
Substrate/Competitorn/a
Meas. Tech.ChEMBL_535095 (CHEMBL981687)
IC50>100000±n/a nM
Citation Hughes, TVEmanuel, SLO'Grady, HRConnolly, PJRugg, CFuentes-Pesquera, ARKarnachi, PAlexander, RMiddleton, SA 7-[1H-Indol-2-yl]-2,3-dihydro-isoindol-1-ones as dual Aurora-A/VEGF-R2 kinase inhibitors: design, synthesis, and biological activity. Bioorg Med Chem Lett18:5130-3 (2008) 
 
Vascular endothelial growth factor receptor 2
Name:Vascular endothelial growth factor receptor 2
Type:Receptor Tyrosine Kinase
Mol. Mass.:151510.97
Organism:Homo sapiens (Human)
Description:P35968
Residue:1356
BDBM50264616
NameBDBM50264616
Synonyms:3-oxoisoindoline-4-carboxamide | CHEMBL505167
TypeSmall organic molecule
Emp. Form.C9H8N2O2
Mol. Mass.176.172
SMILESNC(=O)c1cccc2CNC(=O)c12