Reaction Details
TargetVascular endothelial growth factor receptor 2
LigandBDBM50264551
Substrate/Competitorn/a
Meas. Tech.ChEMBL_535095 (CHEMBL981687)
IC50 18±n/a nM
Citation Hughes, TVEmanuel, SLO'Grady, HRConnolly, PJRugg, CFuentes-Pesquera, ARKarnachi, PAlexander, RMiddleton, SA 7-[1H-Indol-2-yl]-2,3-dihydro-isoindol-1-ones as dual Aurora-A/VEGF-R2 kinase inhibitors: design, synthesis, and biological activity. Bioorg Med Chem Lett18:5130-3 (2008) 
 
Vascular endothelial growth factor receptor 2
Name:Vascular endothelial growth factor receptor 2
Type:Receptor Tyrosine Kinase
Mol. Mass.:151510.97
Organism:Homo sapiens (Human)
Description:P35968
Residue:1356
BDBM50264551
NameBDBM50264551
Synonyms:7-(5-(3-(4-hydroxypiperidin-1-yl)propoxy)-1H-indol-2-yl)isoindolin-1-one | CHEMBL522601
TypeSmall organic molecule
Emp. Form.C24H27N3O3
Mol. Mass.405.4895
SMILESOC1CCN(CCCOc2ccc3[nH]c(cc3c2)-c2cccc3CNC(=O)c23)CC1