Reaction Details
TargetVascular endothelial growth factor receptor 2
LigandBDBM50264549
Substrate/Competitorn/a
Meas. Tech.ChEMBL_535095 (CHEMBL981687)
IC50>100000±n/a nM
Citation Hughes, TVEmanuel, SLO'Grady, HRConnolly, PJRugg, CFuentes-Pesquera, ARKarnachi, PAlexander, RMiddleton, SA 7-[1H-Indol-2-yl]-2,3-dihydro-isoindol-1-ones as dual Aurora-A/VEGF-R2 kinase inhibitors: design, synthesis, and biological activity. Bioorg Med Chem Lett18:5130-3 (2008) 
 
Vascular endothelial growth factor receptor 2
Name:Vascular endothelial growth factor receptor 2
Type:Receptor Tyrosine Kinase
Mol. Mass.:151510.97
Organism:Homo sapiens (Human)
Description:P35968
Residue:1356
BDBM50264549
NameBDBM50264549
Synonyms:CHEMBL491243 | tert-butyl 2-(2-methyl-3-oxoisoindolin-4-yl)-1H-pyrrole-1-carboxylate
TypeSmall organic molecule
Emp. Form.C18H20N2O3
Mol. Mass.312.363
SMILESCN1Cc2cccc(-c3cccn3C(=O)OC(C)(C)C)c2C1=O