Reaction Details
TargetCyclin-dependent kinase 1
LigandBDBM50264611
Substrate/Competitorn/a
Meas. Tech.ChEMBL_535097 (CHEMBL981689)
IC50 13300±n/a nM
Citation Hughes, TVEmanuel, SLO'Grady, HRConnolly, PJRugg, CFuentes-Pesquera, ARKarnachi, PAlexander, RMiddleton, SA 7-[1H-Indol-2-yl]-2,3-dihydro-isoindol-1-ones as dual Aurora-A/VEGF-R2 kinase inhibitors: design, synthesis, and biological activity. Bioorg Med Chem Lett18:5130-3 (2008) 
 
Cyclin-dependent kinase 1
Name:Cyclin-dependent kinase 1
Type:Enzyme Subunit
Mol. Mass.:34101.08
Organism:Homo sapiens (Human)
Description:P06493
Residue:297
BDBM50264611
NameBDBM50264611
Synonyms:7-(5-hydroxy-1H-indol-2-yl)isoindolin-1-one | CHEMBL443338
TypeSmall organic molecule
Emp. Form.C16H12N2O2
Mol. Mass.264.2787
SMILESOc1ccc2[nH]c(cc2c1)-c1cccc2CNC(=O)c12