Reaction Details
TargetCyclin-dependent kinase 1
LigandBDBM50264549
Substrate/Competitorn/a
Meas. Tech.ChEMBL_535097 (CHEMBL981689)
IC50>100000±n/a nM
Citation Hughes, TVEmanuel, SLO'Grady, HRConnolly, PJRugg, CFuentes-Pesquera, ARKarnachi, PAlexander, RMiddleton, SA 7-[1H-Indol-2-yl]-2,3-dihydro-isoindol-1-ones as dual Aurora-A/VEGF-R2 kinase inhibitors: design, synthesis, and biological activity. Bioorg Med Chem Lett18:5130-3 (2008) 
 
Cyclin-dependent kinase 1
Name:Cyclin-dependent kinase 1
Type:Enzyme Subunit
Mol. Mass.:34101.08
Organism:Homo sapiens (Human)
Description:P06493
Residue:297
BDBM50264549
NameBDBM50264549
Synonyms:CHEMBL491243 | tert-butyl 2-(2-methyl-3-oxoisoindolin-4-yl)-1H-pyrrole-1-carboxylate
TypeSmall organic molecule
Emp. Form.C18H20N2O3
Mol. Mass.312.363
SMILESCN1Cc2cccc(-c3cccn3C(=O)OC(C)(C)C)c2C1=O