Reaction Details
TargetVitamin D3 receptor
LigandBDBM50292629
Substrate/Competitorn/a
Meas. Tech.ChEMBL_535143 (CHEMBL984593)
Ki 1±n/a nM
Citation Chiellini, GGrzywacz, PPlum, LABarycki, RClagett-Dame, MDeLuca, HF Synthesis and biological properties of 2-methylene-19-nor-25-dehydro-1alpha-hydroxyvitamin D(3)-26,23-lactones--weak agonists. Bioorg Med Chem16:8563-73 (2008) 
 
Vitamin D3 receptor
Name:Vitamin D3 receptor
Type:PROTEIN
Mol. Mass.:47811.07
Organism:Rattus norvegicus
Description:ChEMBL_1505946
Residue:423
BDBM50292629
NameBDBM50292629
Synonyms:(23S)-25-dehydro-2-methylene-19-nor-1alpha-hydroxyvitaminD3-26,23-lactone CHEMBL263638
TypeSmall organic molecule
Emp. Form.C27H38O4
Mol. Mass.426.5882
SMILES[#6]-[#6@H](-[#6]-[#6@H]-1-[#6]-[#6](=[#6])-[#6](=O)-[#8]-1)-[#6@H]1-[#6]-[#6]-[#6@H]2\[#6](-[#6]-[#6]-[#6][C@]12[#6])=[#6]\[#6]=[#6]-1/[#6]-[#6@@H](-[#8])-[#6](=[#6])-[#6@H](-[#8])-[#6]-1