Reaction Details
TargetMast/stem cell growth factor receptor Kit
LigandBDBM50264437
Substrate/Competitorn/a
Meas. Tech.ChEMBL_535203 (CHEMBL990799)
IC50 1±n/a nM
Citation Kunz, RKRumfelt, SChen, NZhang, DTasker, ASBürli, RHungate, RYu, VNguyen, YWhittington, DAMeagher, KLPlant, MTudor, YSchrag, MXu, YNg, GYHu, E Discovery of amido-benzisoxazoles as potent c-Kit inhibitors. Bioorg Med Chem Lett18:5115-7 (2008) 
 
Mast/stem cell growth factor receptor Kit
Name:Mast/stem cell growth factor receptor Kit
Type:Protein
Mol. Mass.:109869.37
Organism:Homo sapiens (Human)
Description:P10721
Residue:976
BDBM50264437
NameBDBM50264437
Synonyms:CHEMBL488984 | N-(2-aminopyrimidin-5-yl)-6-chloro-3-(3-(trifluoromethyl)phenylamino)benzo[d]isoxazole-7-carboxamide
TypeSmall organic molecule
Emp. Form.C19H12ClF3N6O2
Mol. Mass.448.786
SMILESNc1ncc(NC(=O)c2c(Cl)ccc3c(Nc4cccc(c4)C(F)(F)F)noc23)cn1