Reaction Details
TargetProstasin
LigandBDBM50246994
Substrate/Competitorn/a
Meas. Tech.ChEMBL_557785 (CHEMBL953294)
Ki 41±n/a nM
Citation Tully, DCVidal, AChatterjee, AKWilliams, JARoberts, MJPetrassi, HMSpraggon, GBursulaya, BPacoma, RShipway, ASchumacher, AMDanahay, HHarris, JL Discovery of inhibitors of the channel-activating protease prostasin (CAP1/PRSS8) utilizing structure-based design. Bioorg Med Chem Lett18:5895-9 (2008) 
 
Prostasin
Name:Prostasin
Type:PROTEIN
Mol. Mass.:36426.48
Organism:Homo sapiens (Human)
Description:ChEMBL_557785
Residue:343
BDBM50246994
NameBDBM50246994
Synonyms:CHEMBL443101 | benzyl (R)-1-((2S,4R)-2-(((S)-6-amino-1-(benzo[d]oxazol-2-yl)-1-oxohexan-2-yl)carbamoyl)-4-(3-(trifluoromethyl)benzyloxy)pyrrolidin-1-yl)-1-oxo-4-phenylbutan-2-ylcarbamate
TypeSmall organic molecule
Emp. Form.C44H46F3N5O7
Mol. Mass.813.8605
SMILESNCCCC[C@H](NC(=O)[C@@H]1C[C@H](CN1C(=O)[C@@H](CCc1ccccc1)NC(=O)OCc1ccccc1)OCc1cccc(c1)C(F)(F)F)C(=O)c1nc2ccccc2o1