Reaction Details
TargetProstasin
LigandBDBM50246997
Substrate/Competitorn/a
Meas. Tech.ChEMBL_557785 (CHEMBL953294)
Ki 27±n/a nM
Citation Tully, DCVidal, AChatterjee, AKWilliams, JARoberts, MJPetrassi, HMSpraggon, GBursulaya, BPacoma, RShipway, ASchumacher, AMDanahay, HHarris, JL Discovery of inhibitors of the channel-activating protease prostasin (CAP1/PRSS8) utilizing structure-based design. Bioorg Med Chem Lett18:5895-9 (2008) 
 
Prostasin
Name:Prostasin
Type:PROTEIN
Mol. Mass.:36426.48
Organism:Homo sapiens (Human)
Description:ChEMBL_557785
Residue:343
BDBM50246997
NameBDBM50246997
Synonyms:CHEMBL505738 | benzyl (R)-1-((2S,4R)-2-(((S)-6-amino-1-(benzo[d]oxazol-2-yl)-1-oxohexan-2-yl)carbamoyl)-4-(4-fluorobenzyloxy)pyrrolidin-1-yl)-1-oxo-4-phenylbutan-2-ylcarbamate
TypeSmall organic molecule
Emp. Form.C43H46FN5O7
Mol. Mass.763.853
SMILESNCCCC[C@H](NC(=O)[C@@H]1C[C@H](CN1C(=O)[C@@H](CCc1ccccc1)NC(=O)OCc1ccccc1)OCc1ccc(F)cc1)C(=O)c1nc2ccccc2o1