Reaction Details
TargetPotassium voltage-gated channel subfamily H member 2
LigandBDBM50265098
Substrate/Competitorn/a
Meas. Tech.ChEMBL_496715 (CHEMBL1006160)
IC50 600±n/a nM
Citation Pinard, EAlberati, DBorroni, EFischer, HHainzl, DJolidon, SMoreau, JLNarquizian, RNettekoven, MNorcross, RDStalder, HThomas, AW Discovery of benzoylpiperazines as a novel class of potent and selective GlyT1 inhibitors. Bioorg Med Chem Lett18:5134-9 (2008) 
 
Potassium voltage-gated channel subfamily H member 2
Name:Potassium voltage-gated channel subfamily H member 2
Type:Multi-pass membrane protein
Mol. Mass.:126672.65
Organism:Homo sapiens (Human)
Description:Q12809
Residue:1159
BDBM50265098
NameBDBM50265098
Synonyms:4-(4-(2-(cyclopropylmethoxy)-5-(methylsulfonyl)benzoyl)piperazin-1-yl)-3-fluorobenzonitrile | CHEMBL497999
TypeSmall organic molecule
Emp. Form.C23H24FN3O4S
Mol. Mass.457.518
SMILESCS(=O)(=O)c1ccc(OCC2CC2)c(c1)C(=O)N1CCN(CC1)c1ccc(cc1F)C#N