Reaction Details
TargetEgl nine homolog 1
LigandBDBM50264173
Substrate/Competitorn/a
Meas. Tech.ChEMBL_535338 (CHEMBL983464)
IC50 570±n/a nM
Citation Frohn, MViswanadhan, VPickrell, AJGolden, JEMuller, KMBürli, RWBiddlecome, GYoder, SCRogers, NDao, JHHungate, RAllen, JR Structure-guided design of substituted aza-benzimidazoles as potent hypoxia inducible factor-1alpha prolyl hydroxylase-2 inhibitors. Bioorg Med Chem Lett18:5023-6 (2008) 
 
Egl nine homolog 1
Name:Egl nine homolog 1
Type:Protein
Mol. Mass.:46035.59
Organism:Homo sapiens (Human)
Description:Q9GZT9
Residue:426
BDBM50264173
NameBDBM50264173
Synonyms:2-(1-methyl-1H-imidazo[4,5-c]pyridine-4-carboxamido)acetic acid | CHEMBL448208
TypeSmall organic molecule
Emp. Form.C10H10N4O3
Mol. Mass.234.2114
SMILESCn1cnc2c(nccc12)C(=O)NCC(O)=O