Reaction Details
TargetEgl nine homolog 1
LigandBDBM50264176
Substrate/Competitorn/a
Meas. Tech.ChEMBL_535338 (CHEMBL983464)
IC50 330±n/a nM
Citation Frohn, MViswanadhan, VPickrell, AJGolden, JEMuller, KMBürli, RWBiddlecome, GYoder, SCRogers, NDao, JHHungate, RAllen, JR Structure-guided design of substituted aza-benzimidazoles as potent hypoxia inducible factor-1alpha prolyl hydroxylase-2 inhibitors. Bioorg Med Chem Lett18:5023-6 (2008) 
 
Egl nine homolog 1
Name:Egl nine homolog 1
Type:Protein
Mol. Mass.:46035.59
Organism:Homo sapiens (Human)
Description:Q9GZT9
Residue:426
BDBM50264176
NameBDBM50264176
Synonyms:2-(1-(4-bromophenyl)-1H-imidazo[4,5-c]pyridine-4-carboxamido)acetic acid | CHEMBL491424
TypeSmall organic molecule
Emp. Form.C15H11BrN4O3
Mol. Mass.375.177
SMILESOC(=O)CNC(=O)c1nccc2n(cnc12)-c1ccc(Br)cc1