Reaction Details
TargetEgl nine homolog 1
LigandBDBM50264221
Substrate/Competitorn/a
Meas. Tech.ChEMBL_535338 (CHEMBL983464)
IC50 1400±n/a nM
Citation Frohn, MViswanadhan, VPickrell, AJGolden, JEMuller, KMBürli, RWBiddlecome, GYoder, SCRogers, NDao, JHHungate, RAllen, JR Structure-guided design of substituted aza-benzimidazoles as potent hypoxia inducible factor-1alpha prolyl hydroxylase-2 inhibitors. Bioorg Med Chem Lett18:5023-6 (2008) 
 
Egl nine homolog 1
Name:Egl nine homolog 1
Type:Protein
Mol. Mass.:46035.59
Organism:Homo sapiens (Human)
Description:Q9GZT9
Residue:426
BDBM50264221
NameBDBM50264221
Synonyms:2-(4-hydroxy-8-iodoisoquinoline-3-carboxamido)acetic acid N-[(4-HYDROXY-8-IODOISOQUINOLIN-3-YL)CARBONYL]GLYCINE
TypeSmall organic molecule
Emp. Form.C12H9IN2O4
Mol. Mass.372.1153
SMILESOC(=O)CNC(=O)c1ncc2c(I)cccc2c1O