Reaction Details
TargetMelanocortin receptor 4
LigandBDBM50253746
Substrate/Competitorn/a
Meas. Tech.ChEMBL_538608 (CHEMBL1027398)
Ki 6±n/a nM
Citation Tian, XSwitzer, AGDerose, SAMishra, RKSolinsky, MGMumin, RNEbetino, FHJayasinghe, LRWebster, MEColson, AOCrossdoersen, DPinney, BBFarmer, JADowty, MEObringer, CMCruze, CABurklow, MLSuchanek, PMDong, LDirr, MKSheldon, RJWos, JA Discovery of orally bioavailable 1,3,4-trisubstituted 2-oxopiperazine-based melanocortin-4 receptor agonists as potential antiobesity agents. J Med Chem51:6055-66 (2008) 
 
Melanocortin receptor 4
Name:Melanocortin receptor 4
Type:Enzyme
Mol. Mass.:36949.50
Organism:Homo sapiens (Human)
Description:P32245
Residue:332
BDBM50253746
NameBDBM50253746
Synonyms:(2S)-N-Methyl-2-[(3S)-4-(N-methyl-L-alanyl-4-fluoro-D-phenylalanyl)-2-oxo-3-propyl-1-piperazinyl]-3-(2-naphthalenyl)propanamide | CHEMBL504349
TypeSmall organic molecule
Emp. Form.C34H42FN5O4
Mol. Mass.603.7268
SMILESCCC[C@@H]1N(CCN([C@@H](Cc2ccc3ccccc3c2)C(=O)NC)C1=O)C(=O)[C@@H](Cc1ccc(F)cc1)NC(=O)[C@H](C)NC