Reaction Details
TargetMelanocortin receptor 4
LigandBDBM50253745
Substrate/Competitorn/a
Meas. Tech.ChEMBL_538608 (CHEMBL1027398)
Ki 5±n/a nM
Citation Tian, XSwitzer, AGDerose, SAMishra, RKSolinsky, MGMumin, RNEbetino, FHJayasinghe, LRWebster, MEColson, AOCrossdoersen, DPinney, BBFarmer, JADowty, MEObringer, CMCruze, CABurklow, MLSuchanek, PMDong, LDirr, MKSheldon, RJWos, JA Discovery of orally bioavailable 1,3,4-trisubstituted 2-oxopiperazine-based melanocortin-4 receptor agonists as potential antiobesity agents. J Med Chem51:6055-66 (2008) 
 
Melanocortin receptor 4
Name:Melanocortin receptor 4
Type:Enzyme
Mol. Mass.:36949.50
Organism:Homo sapiens (Human)
Description:P32245
Residue:332
BDBM50253745
NameBDBM50253745
Synonyms:(S)-2-((S)-4-((R)-3-(4-Fluorophenyl)-2-(2-(methylamino)acetamido)propanoyl)-2-oxo-3-propylpiperazin-1-yl)-N-methyl-3-(naphthalen-2-yl)propanamide | CHEMBL452710
TypeSmall organic molecule
Emp. Form.C33H40FN5O4
Mol. Mass.589.7002
SMILESCCC[C@@H]1N(CCN([C@@H](Cc2ccc3ccccc3c2)C(=O)NC)C1=O)C(=O)[C@@H](Cc1ccc(F)cc1)NC(=O)CNC