Reaction Details
TargetMelanocortin receptor 4
LigandBDBM50253743
Substrate/Competitorn/a
Meas. Tech.ChEMBL_538608 (CHEMBL1027398)
Ki 11±n/a nM
Citation Tian, XSwitzer, AGDerose, SAMishra, RKSolinsky, MGMumin, RNEbetino, FHJayasinghe, LRWebster, MEColson, AOCrossdoersen, DPinney, BBFarmer, JADowty, MEObringer, CMCruze, CABurklow, MLSuchanek, PMDong, LDirr, MKSheldon, RJWos, JA Discovery of orally bioavailable 1,3,4-trisubstituted 2-oxopiperazine-based melanocortin-4 receptor agonists as potential antiobesity agents. J Med Chem51:6055-66 (2008) 
 
Melanocortin receptor 4
Name:Melanocortin receptor 4
Type:Enzyme
Mol. Mass.:36949.50
Organism:Homo sapiens (Human)
Description:P32245
Residue:332
BDBM50253743
NameBDBM50253743
Synonyms:1-Amino-N-((R)-3-(4-fluorophenyl)-1-((S)-4-((S)-1-(methylamino)-3-(naphthalen-2-yl)-1-oxopropan-2-yl)-2-propylpiperazin-1-yl)-1-oxopropan-2-yl)cyclobutanecarboxamide | CHEMBL447117
TypeSmall organic molecule
Emp. Form.C35H42FN5O4
Mol. Mass.615.7375
SMILESCCC[C@@H]1N(CCN([C@@H](Cc2ccc3ccccc3c2)C(=O)NC)C1=O)C(=O)[C@@H](Cc1ccc(F)cc1)NC(=O)C1(N)CCC1