Reaction Details
TargetMelanocortin receptor 4
LigandBDBM50253738
Substrate/Competitorn/a
Meas. Tech.ChEMBL_538608 (CHEMBL1027398)
Ki 4±n/a nM
Citation Tian, XSwitzer, AGDerose, SAMishra, RKSolinsky, MGMumin, RNEbetino, FHJayasinghe, LRWebster, MEColson, AOCrossdoersen, DPinney, BBFarmer, JADowty, MEObringer, CMCruze, CABurklow, MLSuchanek, PMDong, LDirr, MKSheldon, RJWos, JA Discovery of orally bioavailable 1,3,4-trisubstituted 2-oxopiperazine-based melanocortin-4 receptor agonists as potential antiobesity agents. J Med Chem51:6055-66 (2008) 
 
Melanocortin receptor 4
Name:Melanocortin receptor 4
Type:Enzyme
Mol. Mass.:36949.50
Organism:Homo sapiens (Human)
Description:P32245
Residue:332
BDBM50253738
NameBDBM50253738
Synonyms:CHEMBL449131 | N-((R)-3-(4-Fluorophenyl)-1-((S)-4-((S)-1-(methylamino)-3-(naphthalen-2-yl)-1-oxopropan-2-yl)-3-oxo-2-propylpiperazin-1-yl)-1-oxopropan-2-yl)isonicotinamide
TypeSmall organic molecule
Emp. Form.C36H38FN5O4
Mol. Mass.623.7164
SMILESCCC[C@@H]1N(CCN([C@@H](Cc2ccc3ccccc3c2)C(=O)NC)C1=O)C(=O)[C@@H](Cc1ccc(F)cc1)NC(=O)c1ccncc1