Reaction Details
TargetPhosphatidylinositol 4,5-bisphosphate 3-kinase catalytic subunit delta isoform
LigandBDBM50265318
Substrate/Competitorn/a
Meas. Tech.ChEMBL_497044 (CHEMBL1008868)
IC50 4±n/a nM
Citation Perry, BBeevers, RBennett, GBuckley, GCrabbe, TGowers, LJames, LJenkins, KLock, CSabin, VWright, S Optimization of a series of multi-isoform PI3 kinase inhibitors. Bioorg Med Chem Lett18:5299-302 (2008) 
 
Phosphatidylinositol 4,5-bisphosphate 3-kinase catalytic subunit delta isoform
Name:Phosphatidylinositol 4,5-bisphosphate 3-kinase catalytic subunit delta isoform
Type:Enzyme Subunit
Mol. Mass.:119489.41
Organism:Homo sapiens (Human)
Description:O00329
Residue:1044
BDBM50265318
NameBDBM50265318
Synonyms:6,6-dimethyl-2-(6-(1-(pyridin-3-ylmethyl)-1H-pyrazol-4-yl)-2H-benzo[b][1,4]oxazin-4(3H)-yl)-6,7-dihydrothiazolo[5,4-c]pyridin-4(5H)-one | CHEMBL496541
TypeSmall organic molecule
Emp. Form.C25H24N6O2S
Mol. Mass.472.562
SMILESCC1(C)Cc2nc(sc2C(=O)N1)N1CCOc2ccc(cc12)-c1cnn(Cc2cccnc2)c1