Reaction Details
TargetDipeptidyl peptidase 9
LigandBDBM50050525
Substrate/Competitorn/a
Meas. Tech.ChEMBL_539004 (CHEMBL1035678)
IC50 360000±n/a nM
Citation Connolly, BASanford, DGChiluwal, AKHealey, SEPeters, DEDimare, MTWu, WLiu, YMaw, HZhou, YLi, YJin, ZSudmeier, JLLai, JHBachovchin, WW Dipeptide boronic acid inhibitors of dipeptidyl peptidase IV: determinants of potency and in vivo efficacy and safety. J Med Chem51:6005-13 (2008) 
 
Dipeptidyl peptidase 9
Name:Dipeptidyl peptidase 9
Type:Enzyme
Mol. Mass.:98260.70
Organism:Homo sapiens (Human)
Description:Q86TI2
Residue:863
BDBM50050525
NameBDBM50050525
Synonyms:(R)-1-((S)-2-aminopropanoyl)pyrrolidin-2-ylboronic acid CHEMBL63860 US11559537, Compound 1129 US8933056, Asp-boroPro
TypeSmall organic molecule
Emp. Form.C7H15BN2O3
Mol. Mass.186.017
SMILESC[C@H](N)C(=O)N1CCC[C@H]1B(O)O