Reaction Details
TargetDipeptidyl peptidase 4
LigandBDBM50171556
Substrate/Competitorn/a
Meas. Tech.ChEMBL_538997 (CHEMBL1035671)
Ki 3.9±n/a nM
Citation Connolly, BASanford, DGChiluwal, AKHealey, SEPeters, DEDimare, MTWu, WLiu, YMaw, HZhou, YLi, YJin, ZSudmeier, JLLai, JHBachovchin, WW Dipeptide boronic acid inhibitors of dipeptidyl peptidase IV: determinants of potency and in vivo efficacy and safety. J Med Chem51:6005-13 (2008) 
 
Dipeptidyl peptidase 4
Name:Dipeptidyl peptidase 4
Type:Enzyme
Mol. Mass.:88271.01
Organism:Homo sapiens (Human)
Description:P27487
Residue:766
BDBM50171556
NameBDBM50171556
Synonyms:(R)-1-((S)-2-amino-3-methylbutanamido)ethylboronic acid CHEMBL365322
TypeSmall organic molecule
Emp. Form.C7H17BN2O3
Mol. Mass.188.032
SMILESCC(C)[C@H](N)C(=O)N[C@@H](C)B(O)O