Reaction Details
TargetDipeptidyl peptidase 8
LigandBDBM50253639
Substrate/Competitorn/a
Meas. Tech.ChEMBL_538996 (CHEMBL1035670)
Ki 880±n/a nM
Citation Connolly, BASanford, DGChiluwal, AKHealey, SEPeters, DEDimare, MTWu, WLiu, YMaw, HZhou, YLi, YJin, ZSudmeier, JLLai, JHBachovchin, WW Dipeptide boronic acid inhibitors of dipeptidyl peptidase IV: determinants of potency and in vivo efficacy and safety. J Med Chem51:6005-13 (2008) 
 
Dipeptidyl peptidase 8
Name:Dipeptidyl peptidase 8
Type:Enzyme
Mol. Mass.:103342.62
Organism:Homo sapiens (Human)
Description:Q6V1X1
Residue:898
BDBM50253639
NameBDBM50253639
Synonyms:(S)-4-amino-5-((R)-1-boronoethylamino)-5-oxopentanoic acid | CHEMBL447366
TypeSmall organic molecule
Emp. Form.C7H15BN2O5
Mol. Mass.218.015
SMILESC[C@H](NC(=O)[C@@H](N)CCC(O)=O)B(O)O