Reaction Details
TargetDelta-type opioid receptor
LigandBDBM50252861
Substrate/Competitorn/a
Meas. Tech.ChEMBL_534707 (CHEMBL982796)
IC50 13500±n/a nM
Citation Ghosh, ALuo, JLiu, CWeltrowska, GLemieux, CChung, NNLu, YSchiller, PW Novel opioid peptide derived antagonists containing (2S)-2-methyl-3-(2,6-dimethyl-4-carbamoylphenyl)propanoic acid [(2S)-Mdcp]. J Med Chem51:5866-70 (2008) 
 
Delta-type opioid receptor
Name:Delta-type opioid receptor
Type:Enzyme Catalytic Domain
Mol. Mass.:40577.25
Organism:MOUSE
Description:P32300
Residue:372
BDBM50252861
NameBDBM50252861
Synonyms:CHEMBL507214 | H-D-Phe-c[Cys-Tyr-DTrp-Orn-Thr-Pen]-Thr-NH2
TypeSmall organic molecule
Emp. Form.C50H67N11O11S2
Mol. Mass.1062.264
SMILESC[C@@H](O)[C@H](NC(=O)[C@H]1NC(=O)[C@@H](NC(=O)[C@H](CCCN)NC(=O)[C@@H](Cc2c[nH]c3ccccc23)NC(=O)[C@H](Cc2ccc(O)cc2)NC(=O)[C@H](CSSC1(C)C)NC(=O)[C@H](N)Cc1ccccc1)[C@@H](C)O)C(N)=O