Reaction Details
TargetSodium- and chloride-dependent glycine transporter 1
LigandBDBM50263360
Substrate/Competitorn/a
Meas. Tech.ChEMBL_536106 (CHEMBL995052)
IC50 154±n/a nM
Citation Jolidon, SAlberati, DDowle, AFischer, HHainzl, DNarquizian, RNorcross, RPinard, E Design, synthesis and structure-activity relationship of simple bis-amides as potent inhibitors of GlyT1. Bioorg Med Chem Lett18:5533-6 (2008) 
 
Sodium- and chloride-dependent glycine transporter 1
Name:Sodium- and chloride-dependent glycine transporter 1
Type:Enzyme
Mol. Mass.:78270.54
Organism:Homo sapiens (Human)
Description:P48067
Residue:706
BDBM50263360
NameBDBM50263360
Synonyms:CHEMBL476555 | N-(2-(7-chloro-1-methyl-2-oxo-5-phenyl-2,3-dihydro-1H-benzo[e][1,4]diazepin-4(5H)-yl)-2-oxoethyl)-3-(4-methoxyphenyl)propanamide
TypeSmall organic molecule
Emp. Form.C28H28ClN3O4
Mol. Mass.505.993
SMILESCOc1ccc(CCC(=O)NCC(=O)N2CC(=O)N(C)c3ccc(Cl)cc3C2c2ccccc2)cc1