Reaction Details
TargetEpidermal growth factor receptor
LigandBDBM50275499
Substrate/Competitorn/a
Meas. Tech.ChEMBL_497146 (CHEMBL1001226)
IC50 6300±n/a nM
Citation Cheung, MHarris, PABadiang, JGPeckham, GEChamberlain, SDAlberti, MJJung, DKHarris, SSBramson, NHEpperly, AHStimpson, SAPeel, MR The identification of pyrazolo[1,5-a]pyridines as potent p38 kinase inhibitors. Bioorg Med Chem Lett18:5428-30 (2008) 
 
Epidermal growth factor receptor
Name:Epidermal growth factor receptor
Type:Receptor Kinase Domain
Mol. Mass.:134279.59
Organism:Homo sapiens (Human)
Description:P00533
Residue:1210
BDBM50275499
NameBDBM50275499
Synonyms:2-(4-fluorophenyl)-3-(4-pyridinyl)pyrazolo-[1,5-a]pyridine | CHEMBL485745
TypeSmall organic molecule
Emp. Form.C18H12FN3
Mol. Mass.289.3064
SMILESFc1ccc(cc1)-c1nn2ccccc2c1-c1ccncc1