Reaction Details
TargetMitogen-activated protein kinase 14
LigandBDBM50275547
Substrate/Competitorn/a
Meas. Tech.ChEMBL_496886 (CHEMBL998555)
IC50 160±n/a nM
Citation Cheung, MHarris, PABadiang, JGPeckham, GEChamberlain, SDAlberti, MJJung, DKHarris, SSBramson, NHEpperly, AHStimpson, SAPeel, MR The identification of pyrazolo[1,5-a]pyridines as potent p38 kinase inhibitors. Bioorg Med Chem Lett18:5428-30 (2008) 
 
Mitogen-activated protein kinase 14
Name:Mitogen-activated protein kinase 14
Type:Serine/threonine-protein kinase
Mol. Mass.:41286.76
Organism:Homo sapiens (Human)
Description:Q16539
Residue:360
BDBM50275547
NameBDBM50275547
Synonyms:6-fluoro-2-(4-fluorophenyl)-3-(pyridin-4-yl)pyrazolo[1,5-a]pyridine | CHEMBL518917
TypeSmall organic molecule
Emp. Form.C18H11F2N3
Mol. Mass.307.2968
SMILESFc1ccc(cc1)-c1nn2cc(F)ccc2c1-c1ccncc1