Reaction Details
TargetMitogen-activated protein kinase 14
LigandBDBM50275550
Substrate/Competitorn/a
Meas. Tech.ChEMBL_496886 (CHEMBL998555)
IC50 150±n/a nM
Citation Cheung, MHarris, PABadiang, JGPeckham, GEChamberlain, SDAlberti, MJJung, DKHarris, SSBramson, NHEpperly, AHStimpson, SAPeel, MR The identification of pyrazolo[1,5-a]pyridines as potent p38 kinase inhibitors. Bioorg Med Chem Lett18:5428-30 (2008) 
 
Mitogen-activated protein kinase 14
Name:Mitogen-activated protein kinase 14
Type:Serine/threonine-protein kinase
Mol. Mass.:41286.76
Organism:Homo sapiens (Human)
Description:Q16539
Residue:360
BDBM50275550
NameBDBM50275550
Synonyms:2-(4-fluorophenyl)-6-methyl-3-(pyridin-4-yl)pyrazolo[1,5-a]pyridine D3RKN_68
TypeSmall organic molecule
Emp. Form.C19H14FN3
Mol. Mass.303.333
SMILESCc1ccc2c(c(nn2c1)-c1ccc(F)cc1)-c1ccncc1