Reaction Details
TargetHistamine H3 receptor
LigandBDBM50274654
Substrate/Competitorn/a
Meas. Tech.ChEMBL_537241 (CHEMBL981856)
IC50 3.40±n/a nM
Citation Nagase, TMizutani, TSekino, EIshikawa, SIto, SMitobe, YMiyamoto, YYoshimoto, RTanaka, TIshihara, ATakenaga, NTokita, SSato, N Synthesis and evaluation of structurally constrained quinazolinone derivatives as potent and selective histamine H3 receptor inverse agonists. J Med Chem51:6889-901 (2008) 
 
Histamine H3 receptor
Name:Histamine H3 receptor
Type:G Protein-Coupled Receptor (GPCR)
Mol. Mass.:48691.47
Organism:Homo sapiens (Human)
Description:Binding assays were using CHO cells stably expressing hH3R receptors.
Residue:445
BDBM50274654
NameBDBM50274654
Synonyms:2-Methyl-3-[4-([3-(1-pyrrolidinyl)cyclopentyl]oxy)phenyl]-4(3H)-quinazolinone | CHEMBL484740
TypeSmall organic molecule
Emp. Form.C24H27N3O2
Mol. Mass.389.4901
SMILESCc1nc2ccccc2c(=O)n1-c1ccc(OC2CCC(C2)N2CCCC2)cc1