Reaction Details
TargetMetabotropic glutamate receptor 5
LigandBDBM50273941
Substrate/Competitorn/a
Meas. Tech.ChEMBL_537952 (CHEMBL1032408)
IC50 40±n/a nM
Citation Ito, SSatoh, ANagatomi, YHirata, YSuzuki, GKimura, TSatow, AMaehara, SHikichi, HHata, MKawamoto, HOhta, H Discovery and biological profile of 4-(1-aryltriazol-4-yl)-tetrahydropyridines as an orally active new class of metabotropic glutamate receptor 1 antagonist. Bioorg Med Chem16:9817-29 (2008) 
 
Metabotropic glutamate receptor 5
Name:Metabotropic glutamate receptor 5
Type:Enzyme
Mol. Mass.:132484.72
Organism:Homo sapiens (Human)
Description:n/a
Residue:1212
BDBM50273941
NameBDBM50273941
Synonyms:CHEMBL456196 | iso-Propyl-4-[1-(2-fuluoropyridine-3-yl)-5-methyl-1H-1,2,3-triazol-4-yl]-3,6-dihydropyridine-1(2H)-carboxylate
TypeSmall organic molecule
Emp. Form.C17H20FN5O2
Mol. Mass.345.3714
SMILESCC(C)OC(=O)N1CCC(=CC1)c1nnn(c1C)-c1cccnc1F