Reaction Details
TargetMetabotropic glutamate receptor 1
LigandBDBM50273828
Substrate/Competitorn/a
Meas. Tech.ChEMBL_537951 (CHEMBL1032407)
IC50 24±n/a nM
Citation Ito, SSatoh, ANagatomi, YHirata, YSuzuki, GKimura, TSatow, AMaehara, SHikichi, HHata, MKawamoto, HOhta, H Discovery and biological profile of 4-(1-aryltriazol-4-yl)-tetrahydropyridines as an orally active new class of metabotropic glutamate receptor 1 antagonist. Bioorg Med Chem16:9817-29 (2008) 
 
Metabotropic glutamate receptor 1
Name:Metabotropic glutamate receptor 1
Type:PROTEIN
Mol. Mass.:133215.40
Organism:Mus musculus
Description:ChEMBL_698434
Residue:1199
BDBM50273828
NameBDBM50273828
Synonyms:CHEMBL511355 | tert-Butyl-4-(1-phenyl-1H-1,2,3-triazole-4-yl)-3,6-dihydropyridine-1(2H)-carboxylate
TypeSmall organic molecule
Emp. Form.C18H22N4O2
Mol. Mass.326.3929
SMILESCC(C)(C)OC(=O)N1CCC(=CC1)c1cn(nn1)-c1ccccc1