Reaction Details
TargetMetabotropic glutamate receptor 1
LigandBDBM50273942
Substrate/Competitorn/a
Meas. Tech.ChEMBL_537951 (CHEMBL1032407)
IC50 3.1±n/a nM
Citation Ito, SSatoh, ANagatomi, YHirata, YSuzuki, GKimura, TSatow, AMaehara, SHikichi, HHata, MKawamoto, HOhta, H Discovery and biological profile of 4-(1-aryltriazol-4-yl)-tetrahydropyridines as an orally active new class of metabotropic glutamate receptor 1 antagonist. Bioorg Med Chem16:9817-29 (2008) 
 
Metabotropic glutamate receptor 1
Name:Metabotropic glutamate receptor 1
Type:PROTEIN
Mol. Mass.:133215.40
Organism:Mus musculus
Description:ChEMBL_698434
Residue:1199
BDBM50273942
NameBDBM50273942
Synonyms:4-(1-(2-fluoropyridin-3-yl)-5-methyl-1H-1,2,3-triazol-4-yl)-N-isopropyl-N-methyl-5,6-dihydropyridine-1(2H)-carboxamide CHEMBL1645350 | CHEMBL502882
TypeSmall organic molecule
Emp. Form.C18H23FN6O
Mol. Mass.358.4132
SMILESCC(C)N(C)C(=O)N1CCC(=CC1)c1nnn(c1C)-c1cccnc1F