Reaction Details
TargetHistone deacetylase 6
LigandBDBM50246033
Substrate/Competitorn/a
Meas. Tech.ChEMBL_558030 (CHEMBL953327)
IC50 320±n/a nM
Citation Muraglia, EAltamura, SBranca, DCecchetti, OFerrigno, FOrsale, MVPalumbi, MCRowley, MScarpelli, RSteinkühler, CJones, P 2-Trifluoroacetylthiophene oxadiazoles as potent and selective class II human histone deacetylase inhibitors. Bioorg Med Chem Lett18:6083-7 (2008) 
 
Histone deacetylase 6
Name:Histone deacetylase 6
Type:Chromatin regulator; hydrolase; repressor
Mol. Mass.:131381.51
Organism:Homo sapiens (Human)
Description:Q9UBN7
Residue:1215
BDBM50246033
NameBDBM50246033
Synonyms:2,2,2-Trifluoro-1-(5-{3-[(methylsulfonyl)methyl]-1,2,4-oxadiazol-5-yl}thiophen-2-yl)ethanone CHEMBL512516
TypeSmall organic molecule
Emp. Form.C10H7F3N2O4S2
Mol. Mass.340.299
SMILESCS(=O)(=O)Cc1noc(n1)-c1ccc(s1)C(=O)C(F)(F)F