Reaction Details
TargetProtein-tyrosine kinase 2-beta
LigandBDBM50246140
Substrate/Competitorn/a
Meas. Tech.ChEMBL_558214 (CHEMBL960612)
IC50 190±n/a nM
Citation Walker, DPBi, FCKalgutkar, ASBauman, JNZhao, SXSoglia, JRAspnes, GEKung, DWKlug-McLeod, JZawistoski, MPMcGlynn, MAOliver, RDunn, MLi, JCRichter, DTCooper, BAKath, JCHulford, CAAutry, CLLuzzio, MJUng, EJRoberts, WGBonnette, PCBuckbinder, LMistry, AGriffor, MCHan, SGuzman-Perez, A Trifluoromethylpyrimidine-based inhibitors of proline-rich tyrosine kinase 2 (PYK2): structure-activity relationships and strategies for the elimination of reactive metabolite formation. Bioorg Med Chem Lett18:6071-7 (2008) 
 
Protein-tyrosine kinase 2-beta
Name:Protein-tyrosine kinase 2-beta
Type:Protein
Mol. Mass.:115868.80
Organism:Homo sapiens (Human)
Description:Q14289
Residue:1009
BDBM50246140
NameBDBM50246140
Synonyms:CHEMBL513744 N-methyl-N-(3-((2-(2-oxoindolin-5-ylamino)-5-(trifluoromethyl)pyrimidin-4-ylamino)methyl)phenyl)methanesulfonamide
TypeSmall organic molecule
Emp. Form.C22H21F3N6O3S
Mol. Mass.506.501
SMILESCN(c1cccc(CNc2nc(Nc3ccc4NC(=O)Cc4c3)ncc2C(F)(F)F)c1)S(C)(=O)=O