Reaction Details
TargetFocal adhesion kinase 1
LigandBDBM50246099
Substrate/Competitorn/a
Meas. Tech.ChEMBL_558213 (CHEMBL962347)
IC50 77±n/a nM
Citation Walker, DPBi, FCKalgutkar, ASBauman, JNZhao, SXSoglia, JRAspnes, GEKung, DWKlug-McLeod, JZawistoski, MPMcGlynn, MAOliver, RDunn, MLi, JCRichter, DTCooper, BAKath, JCHulford, CAAutry, CLLuzzio, MJUng, EJRoberts, WGBonnette, PCBuckbinder, LMistry, AGriffor, MCHan, SGuzman-Perez, A Trifluoromethylpyrimidine-based inhibitors of proline-rich tyrosine kinase 2 (PYK2): structure-activity relationships and strategies for the elimination of reactive metabolite formation. Bioorg Med Chem Lett18:6071-7 (2008) 
 
Focal adhesion kinase 1
Name:Focal adhesion kinase 1
Type:Tyrosine-protein kinase
Mol. Mass.:119233.17
Organism:Homo sapiens (Human)
Description:Q05397
Residue:1052
BDBM50246099
NameBDBM50246099
Synonyms:5-(5-chloro-4-(pyridin-2-ylmethylamino)pyrimidin-2-ylamino)indolin-2-one | CHEMBL511152
TypeSmall organic molecule
Emp. Form.C18H15ClN6O
Mol. Mass.366.804
SMILESClc1cnc(Nc2ccc3NC(=O)Cc3c2)nc1NCc1ccccn1