Reaction Details
TargetFocal adhesion kinase 1
LigandBDBM50246377
Substrate/Competitorn/a
Meas. Tech.ChEMBL_558213 (CHEMBL962347)
IC50 4100±n/a nM
Citation Walker, DPBi, FCKalgutkar, ASBauman, JNZhao, SXSoglia, JRAspnes, GEKung, DWKlug-McLeod, JZawistoski, MPMcGlynn, MAOliver, RDunn, MLi, JCRichter, DTCooper, BAKath, JCHulford, CAAutry, CLLuzzio, MJUng, EJRoberts, WGBonnette, PCBuckbinder, LMistry, AGriffor, MCHan, SGuzman-Perez, A Trifluoromethylpyrimidine-based inhibitors of proline-rich tyrosine kinase 2 (PYK2): structure-activity relationships and strategies for the elimination of reactive metabolite formation. Bioorg Med Chem Lett18:6071-7 (2008) 
 
Focal adhesion kinase 1
Name:Focal adhesion kinase 1
Type:Tyrosine-protein kinase
Mol. Mass.:119233.17
Organism:Homo sapiens (Human)
Description:Q05397
Residue:1052
BDBM50246377
NameBDBM50246377
Synonyms:CHEMBL452340 | N4-((1R,2R)-2-(dimethylamino)cyclopentyl)-N2-(pyridin-4-yl)-5-(trifluoromethyl)pyrimidine-2,4-diamine
TypeSmall organic molecule
Emp. Form.C17H21F3N6
Mol. Mass.366.384
SMILESCN(C)[C@@H]1CCC[C@H]1Nc1nc(Nc2ccncc2)ncc1C(F)(F)F