Reaction Details
TargetAmine oxidase [flavin-containing] B
LigandBDBM50273561
Substrate/Competitorn/a
Meas. Tech.ChEMBL_536002 (CHEMBL988018)
Ki 1.5±n/a nM
Citation La Regina, GSilvestri, RGatti, VLavecchia, ANovellino, EBefani, OTurini, PAgostinelli, E Synthesis, structure-activity relationships and molecular modeling studies of new indole inhibitors of monoamine oxidases A and B. Bioorg Med Chem16:9729-40 (2008) 
 
Amine oxidase [flavin-containing] B
Name:Amine oxidase [flavin-containing] B
Type:PROTEIN
Mol. Mass.:58428.94
Organism:Bos taurus
Description:ChEMBL_1501478
Residue:520
BDBM50273561
NameBDBM50273561
Synonyms:CHEMBL459336 | N-Methyl,N-(3-phenylpropyl)-1-methyl-1H-indole-2-carboxamide
TypeSmall organic molecule
Emp. Form.C20H22N2O
Mol. Mass.306.4015
SMILESCN(CCCc1ccccc1)C(=O)c1cc2ccccc2n1C