Reaction Details
TargetCytochrome P450 2C9
LigandBDBM50275432
Substrate/Competitorn/a
Meas. Tech.ChEMBL_493396 (CHEMBL943377)
EC50 10000±n/a nM
Citation Payne, JEBonnefous, CHassig, CASymons, KTGuo, XNguyen, PMAnnable, TWash, PLHoffman, TZRao, TSShiau, AKMalecha, JWNoble, SAHager, JHSmith, ND Identification of KD5170: a novel mercaptoketone-based histone deacetylase inhibitor. Bioorg Med Chem Lett18:6093-6 (2008) 
 
Cytochrome P450 2C9
Name:Cytochrome P450 2C9
Type:Enzyme
Mol. Mass.:55636.33
Organism:Homo sapiens (Human)
Description:P11712
Residue:490
BDBM50275432
NameBDBM50275432
Synonyms:CHEMBL487965 | S-2-(6-(1,4-dihydrobenzo[d][1,2]dioxine-6-sulfonamido)pyridin-3-yl)-2-oxoethyl ethanethioate
TypeSmall organic molecule
Emp. Form.C17H16N2O6S2
Mol. Mass.408.449
SMILESCC(=O)SCC(=O)c1ccc(NS(=O)(=O)c2ccc3COOCc3c2)nc1