Reaction Details
TargetCytochrome P450 2C9
LigandBDBM50275377
Substrate/Competitorn/a
Meas. Tech.ChEMBL_493396 (CHEMBL943377)
EC50>50000±n/a nM
Citation Payne, JEBonnefous, CHassig, CASymons, KTGuo, XNguyen, PMAnnable, TWash, PLHoffman, TZRao, TSShiau, AKMalecha, JWNoble, SAHager, JHSmith, ND Identification of KD5170: a novel mercaptoketone-based histone deacetylase inhibitor. Bioorg Med Chem Lett18:6093-6 (2008) 
 
Cytochrome P450 2C9
Name:Cytochrome P450 2C9
Type:Enzyme
Mol. Mass.:55636.33
Organism:Homo sapiens (Human)
Description:P11712
Residue:490
BDBM50275377
NameBDBM50275377
Synonyms:CHEMBL520237 | S-2-(6-(4-(3-(dimethylamino)propoxy)phenylsulfonamido)pyridin-3-yl)-2-oxoethyl ethanethioate hydrobromide
TypeSmall organic molecule
Emp. Form.C20H25N3O5S2
Mol. Mass.451.56
SMILESCN(C)CCCOc1ccc(cc1)S(=O)(=O)Nc1ccc(cn1)C(=O)CSC(C)=O