Reaction Details
TargetProstaglandin E2 receptor EP1 subtype
LigandBDBM50259548
Substrate/Competitorn/a
Meas. Tech.ChEMBL_544238 (CHEMBL1010713)
IC50 12.6±n/a nM
Citation Hall, ABrown, SHBudd, CClayton, NMGiblin, GMGoldsmith, PHayhow, TGHurst, DNNaylor, AAnthony Rawlings, DScoccitti, TWilson, AWWinchester, WJ Discovery of GSK345931A: An EP(1) receptor antagonist with efficacy in preclinical models of inflammatory pain. Bioorg Med Chem Lett19:497-501 (2008) 
 
Prostaglandin E2 receptor EP1 subtype
Name:Prostaglandin E2 receptor EP1 subtype
Type:Enzyme
Mol. Mass.:43080.10
Organism:Rattus norvegicus (Rat)
Description:P70597
Residue:405
BDBM50259548
NameBDBM50259548
Synonyms:6-(5'-chloro-2'-isobutoxy-biphenyl-2-yl)-pyridine-2-carboxylate Sodium sodium 6-(5'-chloro-2'-isobutoxybiphenyl-2-yl)picolinate
TypeSmall organic molecule
Emp. Form.C22H19ClNO3
Mol. Mass.380.845
SMILESCC(C)COc1ccc(Cl)cc1-c1ccccc1-c1cccc(n1)C([O-])=O