Reaction Details
TargetProstaglandin E2 receptor EP1 subtype
LigandBDBM50413659
Substrate/Competitorn/a
Meas. Tech.ChEMBL_544164 (CHEMBL1014228)
IC50 100±n/a nM
Citation Hall, ABrown, SHBudd, CClayton, NMGiblin, GMGoldsmith, PHayhow, TGHurst, DNNaylor, AAnthony Rawlings, DScoccitti, TWilson, AWWinchester, WJ Discovery of GSK345931A: An EP(1) receptor antagonist with efficacy in preclinical models of inflammatory pain. Bioorg Med Chem Lett19:497-501 (2008) 
 
Prostaglandin E2 receptor EP1 subtype
Name:Prostaglandin E2 receptor EP1 subtype
Type:Enzyme
Mol. Mass.:41834.57
Organism:Homo sapiens (Human)
Description:P34995
Residue:402
BDBM50413659
NameBDBM50413659
Synonyms:CHEMBL499155
TypeSmall organic molecule
Emp. Form.C22H19ClNO3
Mol. Mass.380.845
SMILESCCCCOc1ccc(Cl)cc1-c1ccccc1-c1cccc(n1)C([O-])=O