Reaction Details
TargetSuppressor of tumorigenicity 14 protein
LigandBDBM104908
Substrate/Competitorn/a
Meas. Tech.ChEMBL_559006 (CHEMBL1010203)
Ki 1±n/a nM
Citation Steinmetzer, TDönnecke, DKorsonewski, MNeuwirth, CSteinmetzer, PSchulze, ASaupe, SMSchweinitz, A Modification of the N-terminal sulfonyl residue in 3-amidinophenylalanine-based matriptase inhibitors. Bioorg Med Chem Lett19:67-73 (2008) 
 
Suppressor of tumorigenicity 14 protein
Name:Suppressor of tumorigenicity 14 protein
Type:Single-pass type II membrane protein
Mol. Mass.:94769.23
Organism:Homo sapiens (Human)
Description:Q9Y5Y6
Residue:855
BDBM104908
NameBDBM104908
Synonyms:CHEMBL468270 | US8569313, Inhibitor 16
TypeSmall organic molecule
Emp. Form.C27H40N6O3S
Mol. Mass.528.71
SMILESNCCCCc1cccc(c1)S(=O)(=O)N[C@@H](Cc1cccc(c1)C(N)=N)C(=O)N1CCC(CCN)CC1