Reaction Details
TargetTransient receptor potential cation channel subfamily V member 1
LigandBDBM50254136
Substrate/Competitorn/a
Meas. Tech.ChEMBL_559260 (CHEMBL1015448)
IC50 4±n/a nM
Citation Lebsack, ADBranstetter, BJHack, MDXiao, WPeterson, MLNasser, NMaher, MPAo, HBhattacharya, AKansagara, MScott, BPLuo, LRynberg, RRizzolio, MChaplan, SRWickenden, ADGuy Breitenbucher, J Identification and synthesis of 2,7-diamino-thiazolo[5,4-d]pyrimidine derivatives as TRPV1 antagonists. Bioorg Med Chem Lett19:40-6 (2008) 
 
Transient receptor potential cation channel subfamily V member 1
Name:Transient receptor potential cation channel subfamily V member 1
Type:Transient Receptor
Mol. Mass.:94956.12
Organism:Rattus norvegicus (rat)
Description:O35433
Residue:838
BDBM50254136
NameBDBM50254136
Synonyms:CHEMBL469297 | N2-(2,6-dichlorophenyl)-N7-(4-(trifluoromethyl)phenyl)thiazolo[5,4-d]pyrimidine-2,7-diamine
TypeSmall organic molecule
Emp. Form.C18H10Cl2F3N5S
Mol. Mass.456.272
SMILESFC(F)(F)c1ccc(Nc2ncnc3sc(Nc4c(Cl)cccc4Cl)nc23)cc1