Reaction Details
TargetTransient receptor potential cation channel subfamily V member 1
LigandBDBM50254421
Substrate/Competitorn/a
Meas. Tech.ChEMBL_559248 (CHEMBL1014667)
IC50 2±n/a nM
Citation Lebsack, ADBranstetter, BJHack, MDXiao, WPeterson, MLNasser, NMaher, MPAo, HBhattacharya, AKansagara, MScott, BPLuo, LRynberg, RRizzolio, MChaplan, SRWickenden, ADGuy Breitenbucher, J Identification and synthesis of 2,7-diamino-thiazolo[5,4-d]pyrimidine derivatives as TRPV1 antagonists. Bioorg Med Chem Lett19:40-6 (2008) 
 
Transient receptor potential cation channel subfamily V member 1
Name:Transient receptor potential cation channel subfamily V member 1
Type:Transient Receptor
Mol. Mass.:94956.12
Organism:Rattus norvegicus (rat)
Description:O35433
Residue:838
BDBM50254421
NameBDBM50254421
Synonyms:CHEMBL465990 | N7-(3-chloro-4-(trifluoromethyl)phenyl)-N2-(2,6-dichlorophenyl)-5-methylthiazolo[5,4-d]pyrimidine-2,7-diamine
TypeSmall organic molecule
Emp. Form.C19H11Cl3F3N5S
Mol. Mass.504.743
SMILESCc1nc(Nc2ccc(c(Cl)c2)C(F)(F)F)c2nc(Nc3c(Cl)cccc3Cl)sc2n1